{"text_format":"1","workbook":"xlsx","n_sheets":6,"sheets":["使用說明","Application","D4041","D4015","setting","Camera"],"not_rendered":{"charts":0,"images":10,"macros":1,"external_links":0,"defined_names":4,"comments":0,"pivot_tables":0},"unopened":[],"bounds":{"document_bytes":16777216,"sheet_cells":100000,"rows_first":2000,"rows_last":500,"rows_between":2000,"halvings":0,"cell_chars":16384,"cell_head_chars":4096},"cells_cut":0,"cells_raw":0,"read":"whole","date_system":"1900"}

{"sheet":"使用說明","index":0,"n_rows":83,"n_cols":18,"rows_kept":83,"cut":false,"hidden":false,"merged":[[0,0,0,14],[1,0,1,14]]}
["日商瑞穗銀行 臺北分行 / 臺中分行 / 高雄分行"]
["Excel  D4041-出口託收申請書 + D4015-匯票 使用説明"]
[]
[null,"使用前注意事項以及設定步驟："]
[null,"     1. 初次使用時，必須啟用 Microsoft Excel 巨集功能。"]
[null,"     2. Microsoft Excel 2013 (含) 以後的設定步驟："]
[null,null,null,"開啟 \"檔案\" 選單"]
[]
[]
[]
[]
[]
[]
[]
[null,null,null,"選擇 \"選項\""]
[]
[]
[]
[]
[]
[]
[]
[]
[]
[]
[]
[]
[]
[]
[]
[]
[]
[null,null,null,"進入 \"信任中心設定\""]
[]
[]
[]
[]
[]
[]
[]
{"$rows_left_out":44}
{"sheet":"Application","index":1,"n_rows":98,"n_cols":24,"rows_kept":98,"cut":false,"hidden":false,"merged":[[19,10,19,11],[20,10,20,11],[21,11,21,13],[22,7,22,10],[97,2,97,4],[97,5,97,11],[83,12,88,17],[96,2,96,4],[96,5,96,11],[79,9,79,10],[79,6,79,7],[80,6,80,7],[81,6,81,7],[82,6,82,7],[83,6,83,7],[84,6,84,7],[85,6,85,7],[86,6,86,7],[87,6,87,7],[88,6,88,7],[89,6,89,7],[34,14,34,15],[35,14,35,15],[80,9,80,10],[88,2,88,4],[89,2,89,4],[88,9,88,10],[89,9,89,10],[85,2,85,4],[86,2,86,4],[87,2,87,4],[85,9,85,10],[86,9,86,10],[87,9,87,10],[83,2,83,4],[84,2,84,4],[81,9,81,10],[82,9,82,10],[83,9,83,10],[84,9,84,10],[79,2,79,4],[82,2,82,4],[80,2,80,4],[81,2,81,4],[76,2,76,4],[76,5,76,11],[77,2,77,4],[77,5,77,11],[78,2,78,4],[78,5,78,11],[75,2,75,4],[75,5,75,11],[34,12,34,13],[35,12,35,13],[68,12,68,13],[69,12,69,16],[70,12,70,16],[71,10,71,16],[61,10,61,16],[64,12,64,16],[65,12,65,16],[66,12,66,16],[67,12,67,16],[53,12,53,13],[53,14,53,16],[59,12,59,13],[59,16,59,17],[60,12,60,16],[48,10,48,11],[23,5,23,11],[33,14,33,16],[33,17,33,18],[26,2,26,4],[26,5,26,11],[27,2,27,4],[27,5,27,11],[30,2,30,4],[30,5,30,11],[31,2,31,4],[31,5,31,11],[29,2,29,4],[29,5,29,11],[28,2,28,4],[28,5,28,11],[20,17,20,18],[21,17,21,18],[91,5,91,11],[14,12,14,18],[24,5,24,11],[92,5,92,11],[93,5,93,11],[94,5,94,11],[2,1,2,18],[4,2,7,4],[11,2,11,4],[9,2,9,4],[9,5,9,16],[10,2,10,4],[3,2,3,4],[3,5,3,11],[11,5,11,11],[13,5,13,11],[15,5,15,11],[13,2,13,4],[15,2,15,4],[14,2,14,4],[14,5,14,11],[25,5,25,11]]}
[]
[]
[null," 填 寫 申 請 書 內 容"]
[null,1,"出口託收申請書申請日期",null,null,null,null,null,null,null,null,null,"請輸入申請日期，輸入格式為  YYYY/MM/DD"]
[null,2,"申請種類",null,null,"請選擇代號"]
[null,null,null,null,null,null,null,null,"1. D/P (Documents against pay)",null,null,"2. D/A (Documents against acceptance)"]
[]
[]
[]
[null,3,"AMOUNT 金額"]
[null,"3-1","幣別",null,null,null,null,null,null,null,null,null,"請選擇幣別代碼。例：USD, JPY, EUR"]
[null,"3-2","金額",null,null,null,null,null,null,null,null,null,"請輸入金額數字"]
[]
[null,"4-1","FOREIGN COLLECTING BANK NAME\n代收銀行名稱",null,null,null,null,null,null,null,null,null,"請輸入代收銀行名稱"]
[null,"4-2","FOREIGN COLLECTING BANK ADDRESS\n代收銀行地址",null,null,null,null,null,null,null,null,null,"請輸入代收銀行地址\n* DP/DA 交易，一定要提供代收銀行住址 *\n* 輸入住址時不需換行 *"]
[null,"4-3","代收銀行名稱電腦代號",null,null,null,null,null,null,null,null,null,"代收銀行名稱電腦代號(SWIFT Code)，不確定時請空白"]
[]
[null,null,null,null,null,null,"1. AT","SIGHT",null,null,null,null,null,null,null,null,null,null,null,null,{"$f":"IF($T$18,1,IF(T19,2,IF(T20,3,IF(T21,4,IF(T22,5,IF(T23,6,\"\"))))))","v":""},null,null,{"$f":"IF($T$18,1,0)","v":0}]
[null,"5","TENOR",null,null,null,"2. AT",null,"DAYS AFTER SIGHT",null,null,null,null,null,null,null,null,null,null,null,{"$f":"IF($U$18=1,$H$18,IF($U$18=2,$H$19,IF($U$18=3,$H$20,IF($U$18=4,$H$21,IF($U$18=5,$H$22,IF($U$18=6,$H$23,\"\"))))))","v":""},null,null,{"$f":"IF($T$19,1,0)","v":0}]
[null,null,null,null,null,null,"3. AT",null,"DAYS AFTER B/L DATE",null,{"$f":"IF($U$18=3,IF($F$30=\"\",\"\",$F$30),\"\")","v":""},null,null,null,null,null,null,null,null,null,{"$f":"IF($U$18=2,$I$19,IF($U$18=3,$I$20,IF($U$18=4,$I$21,IF($U$18=5,$I$22,\"\"))))","v":""},null,null,{"$f":"IF($T$20,1,0)","v":0}]
[null,null,null,null,null,null,"4. AT",null,"DAYS FROM B/L DATE",null,{"$f":"IF($U$18=4,IF($F$30=\"\",\"\",$F$30),\"\")","v":""},null,null,null,null,null,null,null,null,null,{"$f":"\"AT  \"&$U$19&\"  \"&$U$20","v":"AT    "},null,null,{"$f":"IF($T$21,1,0)","v":0}]
[null,null,null,null,null,null,"5. AT",null,"DAYS  AFTER  SHIPMENT  DATE",null,null,{"$f":"IF($U$18=5,IF($F$30=\"\",\"\",$F$30),\"\")","v":""},null,null,null,null,null,null,null,null,{"$f":"IF($U$18=3,$U$21&\"  \"&TEXT($K$20,\"[$-409]mmmm d, yyyy;@\"),IF($U$18=4,$U$21&\"  \"&TEXT($K$21,\"[$-409]mmmm d, yyyy;@\"),IF($U$18=5,$U$21&\" \"&TEXT($L$22,\"[$-409]mmmm d, yyyy;@\"),$U$21)))","v":"AT    "},null,null,{"$f":"IF($T$22,1,0)","v":0}]
[null,null,null,null,null,null,"6. AT",null,null,null,null,"(自行輸入)",null,null,null,null,null,null,null,null,null,null,null,{"$f":"IF($T$23,1,0)","v":0}]
[null,6,"DRAWEE付款人",null,null,null,null,null,null,null,null,null,"請輸入匯票付款人 (最長可以輸入60個英文字長度)",null,null,null,null,null,null,{"$f":"IF($X$24<=1,TRUE,FALSE)","v":true},{"$f":"$F$24&\" \"&$F$25&\" \"&$F$26","v":"  "},null,null,{"$f":"SUM(X18:X23)","v":0}]
[null,null,"(匯票Bill of Exchange付款人)",null,null,null,null,null,null,null,null,null,"如需要輸入付款人詳細資料如地址等，",null,null,null,null,null,null,false]
[null,null,"無需提示匯票時, 此欄位空白",null,null,null,null,null,null,null,null,null,"請在左邊分兩行輸入。",null,null,null,null,null,null,false]
[null,7,"DRAWER 發票人(申請人)",null,null,null,null,null,null,null,null,null,"請輸入 DRAWER 發票人(申請人) (最長可以輸入60個英文字長度)",null,null,null,null,null,null,false]
[null,"7-1","電腦編號",null,null,null,null,null,null,null,null,null,"客戶取引先編號，如不清楚不須填寫",null,null,null,null,null,null,false]
[null,8,"MERCHANDISE 品名",null,null,null,null,null,null,null,null,null,"請輸入 MERCHANDISE 品名 (最長可以輸入70個英文字長度)"]
[null,9,"DATE OF B/L 裝運日",null,null,null,null,null,null,null,null,null,"請輸入日期，輸入格式為  YYYY/MM/DD"]
[null,10,"PORT OF LOADING 裝運地",null,null,null,null,null,null,null,null,null,"請輸入 PORT OF LOADING 裝運地"]
[null,11,"PORT OF DESTINATION 卸貨地",null,null,null,null,null,null,null,null,null,"請輸入 PORT OF DESTINATION 卸貨地"]
[]
[null,12,"各文件數量",null,null,null,null,null,null,null,null,null,null,null,"↓自行填入文件名稱",null,null,"↓自行填入文件名稱"]
[null,null,"DRAFT","COMM\nINVOICE","CUS/CONS\nINVOICE","B/L","AIRWAY\nBILL","INSUR.\nPOL/CERT","PKG LIST","ORIGIN\nCERT","W & M\nLIST","INSPECT\nCERT","CERT"]
[]
[]
[null,13,"補充說明事項"]
[null,null,null,null,null,null,null,null,"1. DELIVER DOCUMENTS AGAINST PAYMENT."]
[null,null,null,null,null,null,null,null,"2. DELIVER DOCUMENTS AGAINST ACCEPTANCE."]
{"$rows_left_out":59}
{"sheet":"D4041","index":2,"n_rows":211,"n_cols":38,"rows_kept":211,"cut":false,"hidden":false,"merged":[[209,13,209,15],[127,13,127,15],[179,30,179,36],[183,4,183,13],[183,16,183,25],[186,4,186,13],[186,16,186,25],[188,6,188,10],[188,13,188,17],[189,4,189,13],[157,28,158,30],[143,1,144,20],[144,28,147,29],[144,30,147,35],[145,1,147,20],[148,1,149,2],[148,3,149,20],[168,18,169,36],[170,1,171,1],[170,16,171,17],[170,27,170,28],[171,22,171,26],[159,26,160,27],[159,28,160,30],[180,30,188,36],[172,32,172,36],[175,15,176,17],[175,18,176,19],[175,20,176,28],[175,31,176,36],[178,2,178,14],[172,22,172,28],[159,34,160,36],[161,1,164,36],[166,16,166,17],[167,16,167,17],[168,16,169,17],[159,1,160,2],[159,3,160,4],[159,5,160,8],[159,9,160,11],[159,12,160,15],[159,16,160,18],[159,19,160,20],[159,21,160,23],[159,24,160,25],[194,30,198,36],[193,30,193,31],[193,32,193,36],[192,30,192,32],[192,33,192,36],[189,30,191,30],[189,31,191,36],[189,16,189,25],[191,4,191,28],[157,1,158,2],[157,3,158,4],[157,5,158,8],[157,9,158,11],[157,12,158,15],[157,16,158,18],[157,19,158,20],[157,21,158,23],[157,24,158,25],[157,34,158,36],[157,31,158,33],[157,26,158,27],[159,31,160,33],[46,37,47,38],[42,37,45,38],[49,30,57,36],[26,1,27,2],[26,3,27,4],[28,3,29,4],[28,26,29,27],[28,24,29,25],[28,21,29,23],[39,1,40,1],[44,31,45,36],[44,18,45,19],[44,20,45,28],[55,4,55,13],[55,16,55,25],[35,16,35,17],[36,16,36,17],[37,18,38,36],[39,16,40,17],[57,6,57,10],[22,37,22,38],[13,28,16,29],[13,30,16,35],[17,24,18,27],[11,37,21,38],[26,26,27,27],[26,28,27,30],[26,31,27,33],[26,34,27,36],[21,28,22,30],[21,31,22,36],[24,24,25,36],[26,24,27,25],[28,28,29,30],[61,30,61,32],[58,30,60,30],[61,33,61,36],[48,30,48,36],[68,30,69,36],[28,34,29,36],[60,4,60,28],[64,5,65,12],[65,2,65,4],[64,2,64,4],[69,2,70,13],[58,31,60,36],[63,30,67,36],[62,30,62,31],[62,32,62,36],[24,12,25,18],[152,5,153,27],[28,12,29,15],[28,19,29,20],[28,16,29,18],[24,19,25,23],[72,2,73,13],[75,2,76,13],[140,2,141,5],[138,2,139,5],[135,26,136,27],[133,25,134,25],[135,25,136,25],[132,24,137,24],[132,1,133,3],[79,13,79,15],[44,15,45,17],[57,13,57,17],[58,4,58,13],[58,16,58,25],[133,26,134,27],[26,16,27,18],[26,19,27,20],[26,21,27,23],[1,32,1,36],[1,1,3,16],[6,30,6,31],[7,30,7,31],[6,28,6,29],[7,28,7,29],[11,21,16,21],[11,22,16,27],[12,1,13,20],[14,1,16,20],[17,1,18,2],[17,3,18,20],[17,28,18,36],[19,1,20,3],[19,4,20,36],[30,1,33,36],[47,2,47,14],[52,4,52,13],[52,16,52,25],[41,32,41,36],[41,22,41,28],[21,1,22,4],[21,5,22,27],[37,16,38,17],[40,22,40,26],[39,27,39,28],[24,1,25,11],[28,1,29,2],[26,5,27,8],[26,9,27,11],[26,12,27,15],[28,31,29,33],[28,9,29,11],[28,5,29,8],[155,1,156,11],[152,28,153,30],[152,31,153,36],[98,2,98,36],[97,2,97,36],[99,2,99,36],[101,2,101,36],[103,2,103,36],[130,32,130,36],[142,21,147,21],[142,22,147,27],[150,1,151,3],[150,4,151,36],[155,12,156,18],[155,19,156,23],[155,24,156,36],[136,30,138,34],[152,1,153,4],[148,24,149,27],[148,28,149,36]]}
[]
[null,"TO: MIZUHO BANK, LTD",null,null,null,null,null,null,null,null,null,null,null,null,null,null,null,null,null,null,null,null,null,null,null,null,null,null,"(申請日) DATED",null,null,null,{"$f":"IF(Application!$F$4=\"\",\"\",Application!$F$4)","v":""}]
[]
[null,null,null,null,null,null,null,null,null,null,null,null,null,null,null,null,null,null,null,null,null,null,null,null,null,null,null,null,"課長代理",null,null,"主管",null,null,"經辦"]
[null,"APPLICATION FOR COLLECTION OF EXPORT BILL(S) WITHOUT L/C"]
[]
[null,null,null,null,"( 出 口 託 收 申 請 書 )",null,null,null,null,null,null,null,null,null,null,null,null,null,null,null,null,null,null,null,null,null,null,null,{"$f":"IF(Application!$G$6=1,\"R\",\"£\")","v":"£"},null,"D/P"]
[null,"茲附奉下列匯票及各項單據敬請查照並依本申請書背面所載條款惠予辦理託收為荷",null,null,null,null,null,null,null,null,null,null,null,null,null,null,null,null,null,null,null,null,null,null,null,null,null,null,{"$f":"IF(Application!$G$6=2,\"R\",\"£\")","v":"£"},null,"D/A"]
[null,"WE ARE ENCLOSING HEREWITH DRAFT(S) AND SHIPPING DOCUMENTS FOR COLLECTION AS MENTIONED"]
[null,"BELOW AND AGREE TO THE CONDITIONS SPECIFIED ON THE BACK HERE OF."]
[]
[null,"FOREIGN COLLECTING BANK (代收銀行名稱及地址)",null,null,null,null,null,null,null,null,null,null,null,null,null,null,null,null,null,null,null,"電\n腦\n代\n號",{"$f":"IF(Application!$F$16=\"\",\"\",Application!$F$16)","v":""},null,null,null,null,null,"AMOUNT 金額",null,null,null,null,null,null,null,null,"請\n務\n必\n填\n寫\n此\n欄"]
[null,{"$f":"IF(Application!$F$14=\"\",\"\",Application!$F$14)","v":""}]
[null,null,null,null,null,null,null,null,null,null,null,null,null,null,null,null,null,null,null,null,null,null,null,null,null,null,null,null,{"$f":"IF(Application!$F$11=\"\",\"\",Application!$F$11)","v":""},null,{"$f":"IF(Application!$F$12=\"\",\"\",Application!$F$12)","v":""}]
[null,{"$f":"IF(Application!$F$15=\"\",\"\",Application!$F$15)","v":""}]
[]
[]
[null,"TENOR.",null,{"$f":"IF(Application!$U$21=\"\",\"\",Application!$U$21)","v":"AT    "},null,null,null,null,null,null,null,null,null,null,null,null,null,null,null,null,null,null,null,null,"DUE DATE 到期日"]
[]
[null,"DRAWEE 付款人",null,null,{"$f":"IF(Application!$F$24=\"\",\"\",LEFT(Application!$F$24,60))","v":""}]
[]
[null,"BENEFICIARY 申請人",null,null,null,{"$f":"IF(Application!$F$27=\"\",\"\",LEFT(Application!$F$27,60))","v":""},null,null,null,null,null,null,null,null,null,null,null,null,null,null,null,null,null,null,null,null,null,null,"電腦編號",null,null,{"$f":"IF(Application!$F$28=\"\",\"\",Application!$F$28)","v":""}]
[null,null,null,null,null,null,null,null,null,null,null,null,null,null,null,null,null,null,null,null,null,null,null,null,null,null,null,null,null,null,null,null,null,null,null,null,null,"←"]
[null,"MERCHANDISE 品名",null,null,null,null,null,null,null,null,null,null,"DATE OF B/L",null,null,null,null,null,null,"PORT OF LOADING",null,null,null,null,"PORT OF DISCHARGE / DESTINATION"]
[null,{"$f":"IF(Application!$F$29=\"\",\"\",LEFT(Application!$F$29,70))","v":""},null,null,null,null,null,null,null,null,null,null,{"$f":"IF(Application!$F$30=\"\",\"\",Application!$F$30)","v":""},null,null,null,null,null,null,{"$f":"IF(Application!$F$31=\"\",\"\",Application!$F$31)","v":""},null,null,null,null,{"$f":"IF(Application!$F$32=\"\",\"\",Application!$F$32)","v":""}]
[]
[]
[]
[]
[]
[null,"* If the number of document copies is not specified above or not in conformity to the number of document copies submitted under this application form, Mizuho Bank, with no liability whatsoever, is entitled to correct the number of document copies specified above to be in conformity to the number of document copies submitted under this application form."]
[]
[]
[]
[null,"PLEASE FOLLOW THE UNDER-MENTIONED INSTRUCTIONS MARKED “X”"]
[null,{"$f":"IF(Application!$U$39,\"T\",\"£\")","v":"£"},"DELIVER DOCUMENTS AGAINST PAYMENT.",null,null,null,null,null,null,null,null,null,null,null,null,null,{"$f":"IF(Application!$U$44,\"T\",\"£\")","v":"£"},null,"ALL CHARGES OUTSIDE TAIWAN ARE FOR DRAWEES ACCOUNT."]
[null,{"$f":"IF(Application!$U$40,\"T\",\"£\")","v":"£"},"DELIVER DOCUMENTS AGAINST ACCEPTANCE.",null,null,null,null,null,null,null,null,null,null,null,null,null,{"$f":"IF(Application!$U$45,\"T\",\"£\")","v":"£"},null,"HOLD ACCEPTED DRAFTS AND PRESENT FOR PAYMENT ON DUE DATE."]
[null,{"$f":"IF(Application!$U$41,\"T\",\"£\")","v":"£"},"CABLE US DATE OF PAYMENT,AT OUR COSTS.",null,null,null,null,null,null,null,null,null,null,null,null,null,{"$f":"IF(Application!$U$46,\"T\",\"£\")","v":"£"},null,"IN CASE OF NON-PAYMENT/NON-ACCEPTANCE, STORE THE GOODS AND INSURE AGAINST FIRE AT DRAWER'S EXPENSES 拒付/承兌時代辦存倉、保險等費用由發票人負擔"]
[null,{"$f":"IF(Application!$U$42,\"T\",\"£\")","v":"£"},"CABLE US OF ACCEPTANCE AND MATURITY."]
[null,{"$f":"IF(Application!$U$43,\"T\",\"£\")","v":"£"},"作成拒絕證書",null,null,null,null,null,null,null,null,null,null,null,null,null,{"$f":"IF(Application!$U$48,\"T\",\"£\")","v":"£"},null,"COLLECT INTEREST FROM DRAWEE AT",null,null,null,null,null,null,null,null,{"$f":"IF(Application!$U$48,IF(Application!$L$48=\"\",\"\",Application!$L$48),\"\")","v":""},null,"% P.A."]
{"$rows_left_out":172}
{"sheet":"D4015","index":3,"n_rows":52,"n_cols":24,"rows_kept":52,"cut":false,"hidden":false,"merged":[[28,23,28,26],[42,8,43,16],[42,18,44,26],[44,8,45,16],[13,22,13,26],[34,7,36,26],[38,13,38,19],[38,22,38,26],[32,7,32,8],[32,9,32,22],[15,9,15,26],[40,9,40,26],[0,0,22,0],[0,1,22,1],[0,2,22,2],[0,3,22,3],[0,5,22,5],[1,8,1,13],[9,7,11,26],[3,9,3,10],[3,12,3,20],[3,23,3,26],[7,7,7,8],[7,9,7,22],[25,0,47,0],[25,1,47,1],[25,2,47,2],[25,3,47,3],[25,5,47,5],[50,6,50,9],[51,4,51,27],[50,12,50,13],[5,7,5,16],[30,7,30,16],[21,8,21,16],[46,8,46,16],[42,7,43,7],[17,7,18,7],[26,8,26,13],[13,13,13,19],[17,8,18,16],[17,18,19,26],[19,8,20,16],[28,9,28,10],[28,12,28,20]]}
["Pay to The Order of","ANY BANK or BANKER","Value or Collection","MIZUHO BANK, LTD",null,"AUTHORIZED SIGNATURE"]
[null,null,null,null,null,null,null,"NO.",{"$f":"IF(Application!$F$97=\"\",\"\",Application!$F$97)","v":""},null,null,null,null,null,null,null,null,"BILL OF EXCHANGE"]
[null,null,null,null,null,null,null,null,null,null,null,null,null,null,null,null,null,null,null,null,null,null,"TAIWAN"]
[null,null,null,null,null,null,null,"AMOUNT:",null,{"$f":"IF(Application!$F$11=\"\",\"\",Application!$F$11)","v":""},null,null,{"$f":"IF(Application!$F$12=\"\",\"\",Application!$F$12)","v":""},null,null,null,null,null,null,null,null,null,"DATE",{"$f":"IF(Application!$F$98=\"\",\"\",Application!$F$98)","v":""}]
[]
[null,null,null,null,null,null,null,{"$f":"IF(Application!$U$22=\"\",\"\",Application!$U$22)","v":"AT    "},null,null,null,null,null,null,null,null,null," OF THIS FIRST BILL OF EXCHANGE (SECOND BEING UNPAID)"]
[]
[null,null,null,null,null,null,null,"PAY TO",null,"MIZUHO BANK, LTD.",null,null,null,null,null,null,null,null,null,null,null,null,null,"OR ORDER"]
[]
[null,null,null,null,null,null,null,{"$f":"IF(M4=\"\",\"\",IF(M4=0,\"\",\"The Sum of \"&VLOOKUP(J4,setting!$A$1:$B$13,2,FALSE)&SpellNumber(M4)&\" Value Received\"))","v":""}]
[]
[]
[]
[null,null,null,null,null,null,null,"DRAWN UNDER L/C NO.",null,null,null,null,null,null,null,null,null,null,null,null,null,"DATED"]
[]
[null,null,null,null,null,null,null,"ISSUED BY"]
[]
[null,null,null,null,null,null,null,"TO",{"$f":"IF(Application!$F$24=\"\",\"\",LEFT(Application!$F$24,60))","v":""},null,null,null,null,null,null,null,null,null,{"$f":"IF(Application!$F$27=\"\",\"\",LEFT(Application!$F$27,60))","v":""}]
[]
[null,null,null,null,null,null,null,null,{"$f":"IF(Application!$F$25=\"\",\"\",Application!$F$25)","v":""}]
[]
[null,null,null,null,null,null,null,null,{"$f":"IF(Application!$F$26=\"\",\"\",Application!$F$26)","v":""}]
[]
[]
[]
["Pay to The Order of","ANY BANK or BANKER","Value or Collection","MIZUHO BANK, LTD",null,"AUTHORIZED SIGNATURE"]
[null,null,null,null,null,null,null,"NO.",{"$f":"IF(I2=0,\"\",I2)","v":""},null,null,null,null,null,null,null,null,"BILL OF EXCHANGE",null,null,null,null,null,{"$f":"IF(X2=0,\"\",X2)","v":""}]
[null,null,null,null,null,null,null,null,null,null,null,null,null,null,null,null,null,null,null,null,null,null,"TAIWAN"]
[null,null,null,null,null,null,null,"AMOUNT:",null,{"$f":"IF(J4=0,\"\",J4)","v":""},null,null,{"$f":"M4","v":""},null,null,null,null,null,null,null,null,null,"DATE",{"$f":"IF(X4=0,\"\",X4)","v":""}]
[]
[null,null,null,null,null,null,null,{"$f":"IF(H6=0,\"\",H6)","v":"AT    "},null,null,null,null,null,null,null,null,null," OF THIS SECOND BILL OF EXCHANGE (FIRST BEING UNPAID)"]
[]
[null,null,null,null,null,null,null,"PAY TO",null,"MIZUHO BANK, LTD.",null,null,null,null,null,null,null,null,null,null,null,null,null,"OR ORDER"]
[]
[null,null,null,null,null,null,null,{"$f":"IF(H10=0,\"\",H10)","v":""}]
[]
[]
[]
[null,null,null,null,null,null,null,"DRAWN UNDER L/C NO.",null,null,null,null,null,{"$f":"IF(N14=0,\"\",N14)","v":""},null,null,null,null,null,null,null,"DATED",{"$f":"IF(W14=0,\"\",W14)","v":""}]
[]
{"$rows_left_out":13}
{"sheet":"setting","index":4,"n_rows":13,"n_cols":4,"rows_kept":13,"cut":false,"hidden":true,"merged":[]}
["USD","US Dollars",null,"USD"]
["JPY","Japanese Yen",null,"JPY"]
["EUR","Euro",null,"EUR"]
["TWD","New Taiwan Dollars",null,"SGD"]
["SGD","Singapore Dollars",null,"HKD"]
["HKD","Hong Kong Dollars",null,"CNY"]
["CNY","Renminbi",null,"CAD"]
["CAD","Canadian Dollars",null,"GBP"]
["GBP","Pounds Sterling",null,"CHF"]
["CHF","Swiss Francs",null,"AUD"]
["AUD","Australian Dollars",null,"NZD"]
["NZD","New Zealand Dollars",null,"INR"]
["INR","Indian Rupees"]

{"sheet":"Camera","index":5,"n_rows":13,"n_cols":26,"rows_kept":13,"cut":false,"hidden":true,"merged":[[10,17,14,17]]}
[]
[]
[]
[]
[null,"DRAFT","COMM\nINVOICE","CUS/CONS\nINVOICE","B/L","AIRWAY\nBILL","INSUR\nPOL/CERT","PKG\nLIST","ORIGIN\nCERT","W & M\nLIST","INSPECT\nCERT","CERT",{"$f":"IF(Application!$O$35=\"\",\"\",Application!$O$35)","v":""},{"$f":"IF(Application!$Q$35=\"\",\"\",Application!$Q$35)","v":""},{"$f":"IF(Application!$R$35=\"\",\"\",Application!$R$35)","v":""},{"$f":"IF(Application!$S$35=\"\",\"\",Application!$S$35)","v":""}]
[null,{"$f":"IF(Application!$C$36=\"\",\"\",Application!$C$36)","v":""},{"$f":"IF(Application!$D$36=\"\",\"\",Application!$D$36)","v":""},{"$f":"IF(Application!$E$36=\"\",\"\",Application!$E$36)","v":""},{"$f":"IF(Application!$F$36=\"\",\"\",Application!$F$36)","v":""},{"$f":"IF(Application!$G$36=\"\",\"\",Application!$G$36)","v":""},{"$f":"IF(Application!$H36=\"\",\"\",Application!$H$36)","v":""},{"$f":"IF(Application!$I$36=\"\",\"\",Application!$I$36)","v":""},{"$f":"IF(Application!$J$36=\"\",\"\",Application!$J$36)","v":""},{"$f":"IF(Application!$K$36=\"\",\"\",Application!$K$36)","v":""},{"$f":"IF(Application!$L$36=\"\",\"\",Application!$L$36)","v":""},{"$f":"IF(Application!$M$36=\"\",\"\",Application!$M$36)","v":""},{"$f":"IF(Application!$O$36=\"\",\"\",Application!$O$36)","v":""},{"$f":"IF(Application!$Q$36=\"\",\"\",Application!$Q$36)","v":""},{"$f":"IF(Application!$R$36=\"\",\"\",Application!$R$36)","v":""},{"$f":"IF(Application!$S$36=\"\",\"\",Application!$S$36)","v":""}]
[]
[]
[]
[]
[null,null,null,null,null,null,null,null,null,null,null,null,null,null,null,null,null,"公\n司\n印\n鑑"]
[]
[null,null,null,null,null,null,null,null,null,null,null,null,null,null,null,null,null,null,null,null,null,null,null,null,null,"核章"]