{"text_format":"1","workbook":"xlsx","n_sheets":6,"sheets":["使用說明","Application","D4014","D4015","Camera","setting"],"not_rendered":{"charts":0,"images":10,"macros":1,"external_links":0,"defined_names":4,"comments":0,"pivot_tables":0},"unopened":[],"bounds":{"document_bytes":16777216,"sheet_cells":100000,"rows_first":2000,"rows_last":500,"rows_between":2000,"halvings":0,"cell_chars":16384,"cell_head_chars":4096},"cells_cut":0,"cells_raw":0,"read":"whole","date_system":"1900"}

{"sheet":"使用說明","index":0,"n_rows":83,"n_cols":18,"rows_kept":83,"cut":false,"hidden":false,"merged":[[0,0,0,14],[1,0,1,14]]}
["日商瑞穗銀行 臺北分行 / 臺中分行 / 高雄分行"]
["Excel  D4014-出口押匯申請書 + D4015-匯票 使用説明"]
[]
[null,"使用前注意事項以及設定步驟："]
[null,"     1. 初次使用時，必須啟用 Microsoft Excel 巨集功能。"]
[null,"     2. Microsoft Excel 2013(含) 以後的設定步驟："]
[null,null,null,"開啟 \"檔案\" 選單"]
[]
[]
[]
[]
[]
[]
[]
[null,null,null,"選擇 \"選項\""]
[]
[]
[]
[]
[]
[]
[]
[]
[]
[]
[]
[]
[]
[]
[]
[]
[]
[null,null,null,"進入 \"信任中心設定\""]
[]
[]
[]
[]
[]
[]
[]
[]
[]
[]
[]
[]
[]
[]
[]
[]
[]
[]
[]
[null,null,null,"\"啟用所有巨集\" 功能"]
[]
[]
[]
[]
[]
[]
[]
{"$rows_left_out":24}
{"sheet":"Application","index":1,"n_rows":88,"n_cols":24,"rows_kept":88,"cut":false,"hidden":false,"merged":[[81,5,81,11],[87,2,87,4],[87,5,87,11],[82,5,82,11],[83,5,83,11],[84,5,84,11],[2,1,2,18],[4,2,7,4],[11,2,11,4],[9,2,9,4],[9,5,9,16],[10,2,10,4],[3,2,3,4],[3,5,3,11],[11,5,11,11],[29,2,29,4],[29,5,29,11],[31,2,31,4],[31,5,31,11],[16,5,16,11],[35,2,35,4],[13,5,13,11],[14,5,14,11],[20,5,20,11],[19,5,19,11],[17,5,17,11],[13,2,13,4],[14,2,14,4],[17,2,17,4],[19,2,19,4],[20,2,20,4],[16,2,16,4],[24,10,24,11],[25,10,25,11],[27,7,27,10],[26,11,26,13],[28,2,28,4],[28,5,28,11],[50,16,50,17],[51,12,51,16],[38,14,38,16],[38,17,38,18],[32,2,32,4],[32,5,32,11],[33,2,33,4],[33,5,33,11],[36,2,36,4],[36,5,36,11],[37,2,37,4],[37,5,37,11],[35,5,35,11],[34,2,34,4],[34,5,34,11],[30,5,30,11],[67,2,67,4],[67,5,67,11],[68,2,68,4],[68,5,68,11],[39,14,39,15],[40,14,40,15],[66,2,66,4],[66,5,66,11],[39,12,39,13],[40,12,40,13],[59,12,59,13],[60,12,60,16],[61,12,61,16],[62,10,62,16],[52,10,52,16],[55,12,55,16],[56,12,56,16],[57,12,57,16],[58,12,58,16],[44,12,44,13],[44,14,44,16],[50,12,50,13],[77,9,77,10],[73,2,73,4],[74,2,74,4],[75,2,75,4],[71,9,71,10],[72,9,72,10],[73,9,73,10],[74,9,74,10],[69,2,69,4],[72,2,72,4],[70,2,70,4],[71,2,71,4],[73,12,78,17],[86,2,86,4],[86,5,86,11],[69,9,69,10],[69,6,69,7],[70,6,70,7],[71,6,71,7],[72,6,72,7],[73,6,73,7],[74,6,74,7],[75,6,75,7],[76,6,76,7],[77,6,77,7],[78,6,78,7],[79,6,79,7],[70,9,70,10],[78,2,78,4],[79,2,79,4],[78,9,78,10],[79,9,79,10],[76,2,76,4],[77,2,77,4],[75,9,75,10],[76,9,76,10]]}
[]
[]
[null," 填 寫 申 請 書 內 容"]
[null,1,"出口押匯申請書申請日期",null,null,null,null,null,null,null,null,null,"請輸入申請日期，輸入格式為  YYYY/MM/DD"]
[null,2,"申請種類",null,null,"請選擇代號"]
[null,null,null,null,null,null,null,null,"1. Negotiation (出口押匯)",null,null,"2. Collection under L/C (進帳後付款)"]
[]
[]
[]
[null,3,"押匯 AMOUNT 金額"]
[null,"3-1","幣別",null,null,null,null,null,null,null,null,null,"請選擇幣別代碼。例：USD, JPY, EUR"]
[null,"3-2","金額",null,null,null,null,null,null,null,null,null,"請輸入金額數字"]
[]
[null,4,"L/C ISSUING BANK 開狀行",null,null,null,null,null,null,null,null,null,"請輸入開狀銀行名稱 (最長可以輸入129個英文字長度)"]
[null,"4-1","開狀行名稱電腦代號",null,null,null,null,null,null,null,null,null,"開狀行名稱電腦代號(SWIFT Code)，不確定時請空白"]
[]
[null,5,"REIMBURSING BANK 求償行",null,null,null,null,null,null,null,null,null,"請輸入求償銀行名稱 (不明時免填)"]
[null,"5-1","求償行名稱電腦代號",null,null,null,null,null,null,null,null,null,"求償行名稱電腦代號(SWIFT Code)，不確定時請空白"]
[]
[null,6,"L/C NO.信用狀號碼",null,null,null,null,null,null,null,null,null,"請輸入 L/C NO. 信用狀號碼"]
[null,7,"ISSUING DATE 開狀日",null,null,null,null,null,null,null,null,null,"請輸入日期，輸入格式為  YYYY/MM/DD"]
[]
[null,null,null,null,null,null,"1. AT","SIGHT",null,null,null,null,null,null,null,null,null,null,null,null,{"$f":"IF($T$23,1,IF(T24,2,IF(T25,3,IF(T26,4,IF(T27,5,IF(T28,6,\"\"))))))","v":""},null,null,{"$f":"IF($T$23,1,0)","v":0}]
[null,8,"TENOR 付款期限",null,null,null,"2. AT",null,"DAYS AFTER SIGHT",null,null,null,null,null,null,null,null,null,null,null,{"$f":"IF($U$23=1,$H$23,IF($U$23=2,$H$24,IF($U$23=3,$H$25,IF($U$23=4,$H$26,IF($U$23=5,$H$27,IF($U$23=6,$H$28,\"\"))))))","v":""},null,null,{"$f":"IF($T$24,1,0)","v":0}]
[null,null,null,null,null,null,"3. AT",null,"DAYS AFTER B/L DATE",null,{"$f":"IF($U$23=3,IF($F$36=\"\",\"\",$F$36),\"\")","v":""},null,null,null,null,null,null,null,null,null,{"$f":"IF($U$23=2,$I$24,IF($U$23=3,$I$25,IF($U$23=4,$I$26,IF($U$23=5,$I$27,\"\"))))","v":""},null,null,{"$f":"IF($T$25,1,0)","v":0}]
[null,null,null,null,null,null,"4. AT",null,"DAYS FROM B/L DATE",null,{"$f":"IF($U$23=4,IF($F$36=\"\",\"\",$F$36),\"\")","v":""},null,null,null,null,null,null,null,null,null,{"$f":"\"AT  \"&$U$24&\"  \"&$U$25","v":"AT    "},null,null,{"$f":"IF($T$26,1,0)","v":0}]
[null,null,null,null,null,null,"5. AT",null,"DAYS  AFTER  SHIPMENT  DATE",null,null,{"$f":"IF($U$23=5,IF($F$36=\"\",\"\",$F$36),\"\")","v":""},null,null,null,null,null,null,null,null,{"$f":"IF($U$23=3,$U$26&\"  \"&TEXT($K$25,\"[$-409]mmmm d, yyyy;@\"),IF($U$23=4,$U$26&\"  \"&TEXT($K$26,\"[$-409]mmmm d, yyyy;@\"),IF($U$23=5,$U$26&\"  \"&TEXT($L$27,\"[$-409]mmmm d, yyyy;@\"),$U$26)))","v":"AT    "},null,null,{"$f":"IF($T$27,1,0)","v":0}]
[null,null,null,null,null,null,"6. AT",null,null,null,null,"(自行輸入)",null,null,null,null,null,null,null,null,null,null,null,{"$f":"IF($T$28,1,0)","v":0}]
[null,9,"DRAWEE付款人",null,null,null,null,null,null,null,null,null,"請輸入匯票付款人 (最長可以輸入60個英文字長度)",null,null,null,null,null,null,{"$f":"IF($X$29<=1,TRUE,FALSE)","v":true},null,null,null,{"$f":"SUM(X23:X28)","v":0}]
[null,null,"(匯票Bill of Exchange付款人)",null,null,null,null,null,null,null,null,null,"如需要輸入付款人詳細資料如地址等，"]
[null,null,"無需提示匯票時, 此欄位空白",null,null,null,null,null,null,null,null,null,"請在左邊分兩行輸入。"]
[null,10,"APPLICANT 開狀人",null,null,null,null,null,null,null,null,null,"請輸入 APPLICANT 開狀人"]
[null,11,"BENEFICIARY 申請人名稱",null,null,null,null,null,null,null,null,null,"請輸入 BENEFICIARY 申請人名稱 (最長可以輸入60個英文字長度)"]
[null,"11-1","電腦編號",null,null,null,null,null,null,null,null,null,"客戶取引先編號，如不清楚不須填寫"]
[null,12,"MERCHANDISE 貨品名",null,null,null,null,null,null,null,null,null,"請輸入 MERCHANDISE 貨品名 (最長可以輸入70個英文字長度)"]
[null,13,"DATE OF B/L 裝運日",null,null,null,null,null,null,null,null,null,"請輸入日期，輸入格式為  YYYY/MM/DD"]
[null,14,"PORT OF LOADING 裝運地",null,null,null,null,null,null,null,null,null,"請輸入 PORT OF LOADING 裝運地"]
[null,15,"PORT OF DESTINATION 卸貨地",null,null,null,null,null,null,null,null,null,"請輸入 PORT OF DESTINATION 卸貨地"]
[null,16,"各文件數量",null,null,null,null,null,null,null,null,null,null,null,"↓自行填入文件名稱",null,null,"↓自行填入文件名稱"]
[null,null,"DRAFT","COMM\nINVOICE","CUS/CONS\nINVOICE","B/L","AIRWAY\nBILL","INSUR\nPOL/CERT","PKG LIST","ORIGIN\nCERT","W & M\nLIST","INSPECT\nCERT","CERT"]
[]
[]
[]
[null,17,"有無預售外匯",null,null,"請選擇代號",null,null,"1. 本件未預售外匯"]
[null,null,null,null,null,null,null,null,"2. 本件己預售外匯，預售匯率為：",null,null,null,"契約號碼："]
[]
[]
[null,18,"押匯款處理指示"]
[null,null,"( DISPOSITION OF PROCEEDS )",null,null,null,null,null,"【外幣部份】"]
[]
[null,null,null,null,null,null,null,null,"1. 存入本公司在貴行外匯存款",null,null,"幣別：",null,null,null,"金額:",null,null,null,null,false]
[null,null,null,null,null,null,null,null,"     FX DEPOSIT",null,null,"存入帳號："]
[null,null,null,null,null,null,null,null,"2. 其他 OTHERS",null,null,null,null,null,null,null,null,null,null,null,false]
[]
[null,null,null,null,null,null,null,null,"【台幣部份】"]
[null,null,null,null,null,null,null,null,"3. 存入本公司在貴行活存",null,null,"存入帳號："]
[null,null,null,null,null,null,null,null,null,null,null,"金額："]
[null,null,null,null,null,null,null,null,"4. 存入本公司在貴行支存",null,null,"存入帳號："]
[null,null,null,null,null,null,null,null,null,null,null,"金額："]
[null,null,null,null,null,null,null,null,"5. 匯往本公司在",null,null,"銀行",null,null,"分行"]
{"$rows_left_out":29}
{"sheet":"D4014","index":2,"n_rows":157,"n_cols":39,"rows_kept":157,"cut":false,"hidden":false,"merged":[[43,38,46,38],[47,38,48,38],[79,13,79,15],[155,13,155,15],[63,30,67,36],[62,30,62,31],[62,32,62,36],[61,30,61,32],[61,33,61,36],[58,30,60,30],[58,31,60,36],[140,30,144,36],[139,30,139,31],[139,32,139,36],[138,30,138,32],[138,33,138,36],[135,30,137,30],[135,31,137,36],[91,1,93,20],[92,22,93,27],[92,28,94,29],[99,1,100,6],[99,7,100,15],[86,3,87,8],[88,3,89,8],[82,35,83,36],[84,14,85,20],[82,14,83,20],[82,27,85,30],[129,4,129,13],[129,16,129,25],[104,1,104,30],[114,1,117,36],[90,22,91,27],[118,22,118,28],[118,32,118,36],[106,1,106,30],[106,31,106,36],[108,1,109,13],[108,14,109,20],[108,21,109,28],[108,29,109,36],[92,30,94,35],[94,22,95,27],[95,1,97,20],[96,22,97,27],[99,18,100,35],[102,1,102,30],[134,6,134,10],[134,13,134,17],[135,4,135,13],[135,16,135,25],[137,4,137,28],[121,18,122,19],[121,20,122,28],[121,31,122,36],[124,2,124,14],[125,30,125,36],[126,30,134,36],[132,4,132,13],[132,16,132,25],[37,1,40,36],[47,2,47,14],[41,32,41,36],[41,22,41,28],[65,2,65,4],[64,2,64,4],[1,28,1,30],[2,28,2,29],[25,1,25,30],[27,1,27,30],[29,1,29,30],[31,1,32,13],[31,14,32,20],[31,21,32,28],[31,29,32,36],[19,22,20,27],[2,30,2,34],[21,37,28,38],[29,31,29,36],[22,18,23,35],[15,28,17,29],[15,30,17,35],[22,1,23,6],[22,7,23,15],[29,37,29,38],[14,1,16,20],[18,1,20,20],[13,22,14,27],[15,22,16,27],[17,22,18,27],[69,2,70,13],[72,2,73,13],[75,2,76,13],[44,18,45,19],[44,20,45,28],[44,31,45,36],[55,4,55,13],[55,16,55,25],[52,4,52,13],[52,16,52,25],[68,30,69,36],[49,30,57,36],[48,30,48,36],[57,6,57,10],[57,13,57,17],[58,4,58,13],[58,16,58,25],[60,4,60,28],[64,5,65,12]]}
[]
[null,null,null,null,null,null,null,null,null,null,null,null,null,null,null,null,null,null,null,null,null,null,null,null,null,null,null,null,"(申請日)"]
[null,null,null,null,null,null,null,null,null,null,null,null,null,null,null,null,null,null,null,null,null,null,null,null,null,null,null,null,"DATE",null,{"$f":"IF(Application!$F$4=\"\",\"\",Application!$F$4)","v":""}]
[]
[null,null,null,null,null,null,null,null,null,null,null,null,null,null,null,null,null,null,null,null,null,null,null,null,null,null,null,null,"課長代理",null,null,"主管",null,null,"經辦"]
[]
[]
[null,"TO: MIZUHO BANK, LTD",null,null,null,null,null,null,null,null,null,null,null,null,null,null,null,null,null,null,null,null,null,null,null,null,null,null,null,{"$f":"IF(Application!$G$6=1,\"R\",\"£\")","v":"£"},"Negotiation (出口押匯)"]
[null,null,"APPLICATION FOR NEGOTIATION OF EXPORT BILL(S) UNDER L/C",null,null,null,null,null,null,null,null,null,null,null,null,null,null,null,null,null,null,"(出口押匯申請書)",null,null,null,null,null,null,null,{"$f":"IF(Application!$G$6=2,\"R\",\"£\")","v":"£"},"Collection under L/C (進帳後付款)"]
[]
[null,"WE ARE ENCLOSING HEREWITH OUR DOCUMENTARY BILLS FOR NEGOTIATION AS BELOW. ANY EXPENSE PRESENT OR FUTURE INCURRED BY"]
[null,"YOU WILL BE FULLY PAID OR REIMBURSED BY US ON DEMAND AND WE UNDERTAKE TO HOLD OURSELVES LIABLE TO YOU SUBJECT TO UCP"]
[null,"FOR DOCUMENTARY CREDITS, ICC PUBLICATION CURRENTLY IN FORCE."]
[null,"L/C ISSUING BANK 開狀行",null,null,null,null,null,null,null,null,null,null,null,null,null,null,null,null,null,null,null,"電",{"$f":"IF(Application!$F$15=\"\",\"\",Application!$F$15)","v":""},null,null,null,null,null,"AMOUNT 金額"]
[null,{"$f":"IF(Application!$F$14=\"\",\"\",LEFT(Application!$F$14,129))","v":""},null,null,null,null,null,null,null,null,null,null,null,null,null,null,null,null,null,null,null,"腦"]
[null,null,null,null,null,null,null,null,null,null,null,null,null,null,null,null,null,null,null,null,null,"代",null,null,null,null,null,null,{"$f":"IF(Application!$F$11=\"\",\"\",Application!$F$11)","v":""},null,{"$f":"IF(Application!$F$12=\"\",\"\",Application!$F$12)","v":""}]
[null,null,null,null,null,null,null,null,null,null,null,null,null,null,null,null,null,null,null,null,null,"號"]
[null,"REIMBURSING BANK 求償行 (不明時免填)",null,null,null,null,null,null,null,null,null,null,null,null,null,null,null,null,null,null,null,"電",{"$f":"IF(Application!$F$18=\"\",\"\",Application!$F$18)","v":""}]
[null,{"$f":"IF(Application!$F$17=\"\",\"\",Application!$F$17)","v":""},null,null,null,null,null,null,null,null,null,null,null,null,null,null,null,null,null,null,null,"腦"]
[null,null,null,null,null,null,null,null,null,null,null,null,null,null,null,null,null,null,null,null,null,"代"]
[null,null,null,null,null,null,null,null,null,null,null,null,null,null,null,null,null,null,null,null,null,"號"]
[null,"L/C NO.信用狀號碼",null,null,null,null,null,"ISSUING DATE 開狀日",null,null,null,null,null,null,null,null,"TENOR 付款期限",null,null,null,null,null,null,null,null,null,null,null,null,null,null,null,null,null,null,null,null,"請\n務\n必\n填\n寫\n此\n欄"]
[null,{"$f":"IF(Application!$F$20=\"\",\"\",Application!$F$20)","v":""},null,null,null,null,null,{"$f":"IF(Application!$F$21=\"\",\"\",Application!$F$21)","v":""},null,null,null,null,null,null,null,null,null,null,{"$f":"IF(Application!$U$26=\"\",\"\",Application!$U$26)","v":"AT    "}]
[]
[null,"DRAWEE 付款人"]
[null,{"$f":"IF(Application!$F$29=\"\",\"\",LEFT(Application!$F$29,60))","v":""}]
[null,"APPLICANT 開狀人"]
[null,{"$f":"IF(Application!$F$32=\"\",\"\",Application!$F$32)","v":""}]
[null,"BENEFICIARY 申請人",null,null,null,null,null,null,null,null,null,null,null,null,null,null,null,null,null,null,null,null,null,null,null,null,null,null,null,null,null,"電腦編號"]
[null,{"$f":"IF(Application!$F$33=\"\",\"\",LEFT(Application!$F$33,60))","v":""},null,null,null,null,null,null,null,null,null,null,null,null,null,null,null,null,null,null,null,null,null,null,null,null,null,null,null,null,null,{"$f":"IF(Application!$F$34=\"\",\"\",Application!$F$34)","v":""},null,null,null,null,null,"←"]
[null,"MERCHANDISE 貨品名",null,null,null,null,null,null,null,null,null,null,null,null,"DATE OF B/L 裝運日",null,null,null,null,null,null,"PORT OF LOADING 裝運地",null,null,null,null,null,null,null,"PORT OF DESTINATION 卸貨地"]
[null,{"$f":"IF(Application!$F$35=\"\",\"\",LEFT(Application!$F$35,70))","v":""},null,null,null,null,null,null,null,null,null,null,null,null,{"$f":"IF(Application!$F$36=\"\",\"\",Application!$F$36)","v":""},null,null,null,null,null,null,{"$f":"IF(Application!$F$37=\"\",\"\",Application!$F$37)","v":""},null,null,null,null,null,null,null,{"$f":"IF(Application!$F$38=\"\",\"\",Application!$F$38)","v":""}]
[]
[]
[]
[]
[]
[null,"*We guarantee that you can receive the proceeds at maturity within the time period established by you and further undertake to hold you harmless and indemnified against any discrepancy (ies)(No matter identified either by you or the issuing bank) and/or any circumstance(s) including but not limited to bankruptcy or lack of foreign exchange of issuing bank and/or paying bank which may cause non-payment and/or non-acceptance of the said draft(s)/document(s), and we shall refund you the principal with any interest and/or related expenses that may be accrued and/or incurred in connection with the above on receipt of your notice to the effect."]
[]
[]
[]
[null,{"$f":"IF(Application!$G$44=1,\"R\",\"£\")","v":"£"},"本件未預售外匯",null,null,null,null,null,null,null,null,null,null,null,{"$f":"IF(Application!$G$44=2,\"R\",\"£\")","v":"£"}," 本件己預售外匯,預售匯率為：",null,null,null,null,null,null,{"$f":"IF(Application!$G$44=2,IF(Application!$L$45=\"\",\"\",Application!$L$45),\"\")","v":""},null,null,null,null,null,null,"契約號碼：",null,null,{"$f":"IF(Application!$G$44=2,IF(Application!$O$45=\"\",\"\",Application!$O$45),\"\")","v":""}]
[null,"押匯款處理指示（DISPOSITION OF PROCEEDS）"]
[null,null,"「  外幣部份  」如下：",null,null,null,null,null,null,null,null,null,null,null,null,null,null,null,null,null,null,null,null,null,null,null,null,null,null,null,null,null,null,null,null,null,null,null,"實\n行\n證\n印"]
[null,{"$f":"IF(Application!$U$51,\"R\",\"£\")","v":"£"},"存入本公司在貴行外匯存款",null,null,null,null,null,null,null,null,null,null,null,null,"金額",null,null,{"$f":"IF(Application!$U$51,IF(Application!$M$51=\"\",\"\",Application!$M$51),\"\")","v":""},null,{"$f":"IF(Application!$U$51,IF(Application!$Q$51=\"\",\"\",Application!$Q$51),\"\")","v":""},null,null,null,null,null,null,null,null,"存入帳號",null,{"$f":"IF(Application!$U$51,IF(Application!$M$52=\"\",\"\",Application!$M$52),\"\")","v":""}]
[null,null,"FX DEPOSIT",null,null,null,null,null,null,null,null,null,null,null,null,null,null,null,null,null,null,null,null,null,null,null,null,null,null,"A/C NO."]
[null,{"$f":"IF(Application!$U$53,\"R\",\"£\")","v":"£"},"其  他 OTHERS"]
[null,null,{"$f":"IF(Application!$U$53,IF(Application!$K$53=\"\",\"\",Application!$K$53),\"\")","v":""}]
[null,null,"「  新臺幣部份  」如下： ",null,null,null,null,null,null,null,null,null,null,null,null,null,null,null,null,null,null,null,null,null,null,null,null,null,null,null,"申請人其他聲明"]
[null,null,"兌換所得等值新臺幣於扣除各項費用後,  按以下指示處理（金額未註明時,  指全部餘額）",null,null,null,null,null,null,null,null,null,null,null,null,null,null,null,null,null,null,null,null,null,null,null,null,null,null,null,{"$f":"IF(Application!$M$74=\"\",\"\",Application!$M$74)","v":""}]
[]
[null,null,{"$f":"IF(Application!$U$56,\"R\",\"£\")","v":"£"},"存入本公司在貴行活存 "]
[null,null,null,"帳號",{"$f":"IF(Application!$U$56,IF(Application!$M$56=\"\",\"\",Application!$M$56),\"\")","v":""},null,null,null,null,null,null,null,null,null,"金額",null,{"$f":"IF(Application!$U$56,IF(Application!$M$57=\"\",\"\",Application!$M$57),\"\")","v":""}]
[]
[null,null,{"$f":"IF(Application!$U$58,\"R\",\"£\")","v":"£"},"存入本公司在貴行支存 "]
[null,null,null,"帳號",{"$f":"IF(Application!$U$58,IF(Application!$M$58=\"\",\"\",Application!$M$58),\"\")","v":""},null,null,null,null,null,null,null,null,null,"金額",null,{"$f":"IF(Application!$U$58,IF(Application!$M$59=\"\",\"\",Application!$M$59),\"\")","v":""}]
[]
[null,null,{"$f":"IF(Application!$U$60,\"R\",\"£\")","v":"£"},"匯往本公司在",null,null,{"$f":"IF(Application!$U$60,IF(Application!$K$60=\"\",\"\",Application!$K$60),\"\")","v":""},null,null,null,null,"銀行",null,{"$f":"IF(Application!$U$60,IF(Application!$M$60=\"\",\"\",Application!$M$60),\"\")","v":""},null,null,null,null,"分行"]
[null,null,null,"帳號",{"$f":"IF(Application!$U$60,IF(Application!$M$61=\"\",\"\",Application!$M$61),\"\")","v":""},null,null,null,null,null,null,null,null,null,"金額",null,{"$f":"IF(Application!$U$60,IF(Application!$M$62=\"\",\"\",Application!$M$62),\"\")","v":""},null,null,null,null,null,null,null,null,null,null,null,null,null,{"$f":"IF(Application!$F$82=\"\",\"\",\"C.C.C CODE:\")","v":""},{"$f":"IF(Application!$F$82=\"\",\"\",Application!$F$82)","v":""}]
[]
{"$rows_left_out":98}
{"sheet":"D4015","index":3,"n_rows":51,"n_cols":24,"rows_kept":51,"cut":false,"hidden":false,"merged":[[50,4,50,27],[49,12,49,13],[42,18,44,26],[42,8,43,16],[44,8,45,16],[46,8,46,16],[42,7,43,7],[49,6,49,8],[25,2,47,2],[25,3,47,3],[25,5,47,5],[34,7,36,26],[38,13,38,19],[38,22,38,26],[28,9,28,10],[28,12,28,20],[28,23,28,26],[32,7,32,8],[32,9,32,22],[40,7,40,8],[40,9,40,26],[5,7,5,16],[30,7,30,16],[21,8,21,16],[17,7,18,7],[0,0,22,0],[0,1,22,1],[0,2,22,2],[0,3,22,3],[0,5,22,5],[1,8,1,13],[9,7,11,26],[3,9,3,10],[3,12,3,20],[3,23,3,26],[25,0,47,0],[25,1,47,1],[13,22,13,26],[26,8,26,13],[7,7,7,8],[13,13,13,19],[17,18,19,26],[17,8,18,16],[19,8,20,16],[7,9,7,22],[15,7,15,8],[15,9,15,26]]}
["Pay to The Order of","ANY BANK or BANKER","Value or Collection","MIZUHO BANK, LTD",null,"AUTHORIZED SIGNATURE"]
[null,null,null,null,null,null,null,"NO.",{"$f":"IF(Application!$F$87=\"\",\"\",Application!$F$87)","v":""},null,null,null,null,null,null,null,null,"BILL OF EXCHANGE"]
[null,null,null,null,null,null,null,null,null,null,null,null,null,null,null,null,null,null,null,null,null,null,"TAIWAN"]
[null,null,null,null,null,null,null,"AMOUNT:",null,{"$f":"IF(Application!$F$11=\"\",\"\",Application!$F$11)","v":""},null,null,{"$f":"IF(Application!$F$12=\"\",\"\",Application!$F$12)","v":""},null,null,null,null,null,null,null,null,null,"DATE",{"$f":"IF(Application!$F$88=\"\",\"\",Application!$F$88)","v":""}]
[]
[null,null,null,null,null,null,null,{"$f":"IF(Application!$U$27=\"\",\"\",Application!$U$27)","v":"AT    "},null,null,null,null,null,null,null,null,null," OF THIS FIRST BILL OF EXCHANGE (SECOND BEING UNPAID)"]
[]
[null,null,null,null,null,null,null,"PAY TO",null,"MIZUHO BANK, LTD.",null,null,null,null,null,null,null,null,null,null,null,null,null,"OR ORDER"]
[]
[null,null,null,null,null,null,null,{"$f":"IF(M4=\"\",\"\",IF(M4=0,\"\",\"The Sum of \"&VLOOKUP(J4,setting!$A$1:$B$13,2,FALSE)&SpellNumber(M4)&\" Value Received\"))","v":""}]
[]
[]
[]
[null,null,null,null,null,null,null,"DRAWN UNDER L/C NO.",null,null,null,null,null,{"$f":"IF(Application!$F$20=\"\",\"\",Application!$F$20)","v":""},null,null,null,null,null,null,null,"DATED",{"$f":"IF(Application!$F$21=\"\",\"\",Application!$F$21)","v":""}]
[]
[null,null,null,null,null,null,null,"ISSUED BY",null,{"$f":"IF(Application!$F$14=\"\",\"\",Application!$F$14)","v":""}]
[]
[null,null,null,null,null,null,null,"TO",{"$f":"IF(Application!$F$29=\"\",\"\",LEFT(Application!$F$29,60))","v":""},null,null,null,null,null,null,null,null,null,{"$f":"IF(Application!$F$33=\"\",\"\",LEFT(Application!$F$33,60))","v":""}]
[]
[null,null,null,null,null,null,null,null,{"$f":"IF(Application!$F$30=\"\",\"\",Application!$F$30)","v":""}]
[]
[null,null,null,null,null,null,null,null,{"$f":"IF(Application!$F$31=\"\",\"\",Application!$F$31)","v":""}]
[]
[]
[]
["Pay to The Order of","ANY BANK or BANKER","Value or Collection","MIZUHO BANK, LTD",null,"AUTHORIZED SIGNATURE"]
[null,null,null,null,null,null,null,"NO.",{"$f":"IF(I2=0,\"\",I2)","v":""},null,null,null,null,null,null,null,null,"BILL OF EXCHANGE",null,null,null,null,null,{"$f":"IF(X2=0,\"\",X2)","v":""}]
[null,null,null,null,null,null,null,null,null,null,null,null,null,null,null,null,null,null,null,null,null,null,"TAIWAN"]
[null,null,null,null,null,null,null,"AMOUNT:",null,{"$f":"IF(J4=0,\"\",J4)","v":""},null,null,{"$f":"M4","v":""},null,null,null,null,null,null,null,null,null,"DATE",{"$f":"IF(X4=0,\"\",X4)","v":""}]
[]
[null,null,null,null,null,null,null,{"$f":"IF(H6=0,\"\",H6)","v":"AT    "},null,null,null,null,null,null,null,null,null," OF THIS SECOND BILL OF EXCHANGE (FIRST BEING UNPAID)"]
[]
[null,null,null,null,null,null,null,"PAY TO",null,"MIZUHO BANK, LTD.",null,null,null,null,null,null,null,null,null,null,null,null,null,"OR ORDER"]
[]
[null,null,null,null,null,null,null,{"$f":"IF(H10=0,\"\",H10)","v":""}]
[]
[]
[]
[null,null,null,null,null,null,null,"DRAWN UNDER L/C NO.",null,null,null,null,null,{"$f":"IF(N14=0,\"\",N14)","v":""},null,null,null,null,null,null,null,"DATED",{"$f":"IF(W14=0,\"\",W14)","v":""}]
[]
[null,null,null,null,null,null,null,"ISSUED BY",null,{"$f":"IF(J16=0,\"\",J16)","v":""}]
[]
[null,null,null,null,null,null,null,"TO",{"$f":"IF(I18=0,\"\",I18)","v":""},null,null,null,null,null,null,null,null,null,{"$f":"IF(S18=0,\"\",S18)","v":""}]
[]
[null,null,null,null,null,null,null,{"$f":"IF(H20=0,\"\",H20)","v":""},{"$f":"IF(I20=0,\"\",I20)","v":""}]
[]
[null,null,null,null,null,null,null,null,{"$f":"IF(I22=0,\"\",I22)","v":""}]
[]
[]
[null,null,"(D4015) Electronic Application",null,null,null,20240401]
[null,null,null,"Note: ","使用此申請書時，本人/本公司同意不更動除填記欄位以外之申請書內容及文字，若更動該申請書內容或文字而造成  貴行損失時願負一切責任。"]

{"sheet":"Camera","index":4,"n_rows":13,"n_cols":26,"rows_kept":13,"cut":false,"hidden":true,"merged":[[10,17,14,17]]}
[]
[]
[]
[]
[null,"DRAFT","COMM\nINVOICE","CUS/CONS\nINVOICE","B/L","AIRWAY\nBILL","INSUR\nPOL/CERT","PKG\nLIST","ORIGIN\nCERT","W & M\nLIST","INSPECT\nCERT","CERT",{"$f":"IF(Application!$O$40=\"\",\"\",Application!$O$40)","v":""},{"$f":"IF(Application!$Q$40=\"\",\"\",Application!$Q$40)","v":""},{"$f":"IF(Application!$R$40=\"\",\"\",Application!$R$40)","v":""},{"$f":"IF(Application!$S$40=\"\",\"\",Application!$S$40)","v":""}]
[null,{"$f":"IF(Application!$C$41=\"\",\"\",Application!$C$41)","v":""},{"$f":"IF(Application!$D$41=\"\",\"\",Application!$D$41)","v":""},{"$f":"IF(Application!$E$41=\"\",\"\",Application!$E$41)","v":""},{"$f":"IF(Application!$F$41=\"\",\"\",Application!$F$41)","v":""},{"$f":"IF(Application!$G$41=\"\",\"\",Application!$G$41)","v":""},{"$f":"IF(Application!$H$41=\"\",\"\",Application!$H$41)","v":""},{"$f":"IF(Application!$I$41=\"\",\"\",Application!$I$41)","v":""},{"$f":"IF(Application!$J$41=\"\",\"\",Application!$J$41)","v":""},{"$f":"IF(Application!$K$41=\"\",\"\",Application!$K$41)","v":""},{"$f":"IF(Application!$L$41=\"\",\"\",Application!$L$41)","v":""},{"$f":"IF(Application!$M$41=\"\",\"\",Application!$M$41)","v":""},{"$f":"IF(Application!$O$41=\"\",\"\",Application!$O$41)","v":""},{"$f":"IF(Application!$Q$41=\"\",\"\",Application!$Q$41)","v":""},{"$f":"IF(Application!$R$41=\"\",\"\",Application!$R$41)","v":""},{"$f":"IF(Application!$S$41=\"\",\"\",Application!$S$41)","v":""}]
[]
[]
[]
[]
[null,null,null,null,null,null,null,null,null,null,null,null,null,null,null,null,null,"公\n司\n印\n鑑"]
[]
[null,null,null,null,null,null,null,null,null,null,null,null,null,null,null,null,null,null,null,null,null,null,null,null,null,"核章"]

{"sheet":"setting","index":5,"n_rows":13,"n_cols":4,"rows_kept":13,"cut":false,"hidden":true,"merged":[]}
["USD","US Dollars",null,"USD"]
["JPY","Japanese Yen",null,"JPY"]
["EUR","Euro",null,"EUR"]
["TWD","New Taiwan Dollars",null,"SGD"]
["SGD","Singapore Dollars",null,"HKD"]
["HKD","Hong Kong Dollars",null,"CNY"]
["CNY","Renminbi",null,"CAD"]
["CAD","Canadian Dollars",null,"GBP"]
["GBP","Pounds Sterling",null,"CHF"]
["CHF","Swiss Francs",null,"AUD"]
["AUD","Australian Dollars",null,"NZD"]
["NZD","New Zealand Dollars",null,"INR"]
["INR","Indian Rupees"]