{"text_format":"1","workbook":"xlsx","n_sheets":6,"sheets":["使用說明","Application","Beneficiary","Account","Form","camera"],"not_rendered":{"charts":0,"images":20,"macros":1,"external_links":0,"defined_names":7,"comments":0,"pivot_tables":0},"unopened":[],"bounds":{"document_bytes":16777216,"sheet_cells":100000,"rows_first":2000,"rows_last":500,"rows_between":2000,"halvings":0,"cell_chars":16384,"cell_head_chars":4096},"cells_cut":0,"cells_raw":0,"read":"whole","date_system":"1900"}

{"sheet":"使用說明","index":0,"n_rows":30,"n_cols":15,"rows_kept":30,"cut":false,"hidden":false,"merged":[[0,0,0,14],[1,0,1,14],[29,12,29,13]]}
["日商瑞穗銀行 臺北分行 / 臺中分行 / 高雄分行"]
["Excel G7023 - 新臺幣匯款申請書(多筆) 使用説明"]
[]
[null,"事前設定作業 :"]
[null,"     1. 請先在下方 Beneficiary Sheet 內填寫/建立 收款人資料。"]
[null,"     2. 總共可以建立 200 筆常用的收款人資料。"]
[null,"     3. 請先在下方 Account Sheet 內填寫/建立 常用扣款帳號資訊。"]
[null,"     4. 總共可以建立 20 筆常用的扣款帳號資訊。"]
[null,"     5. 收款人資料以及常用扣款帳號資訊填寫完成後請記得儲存。"]
[]
[null,"每次匯款時之匯出匯款申請書的填寫方式："]
[null,"     1. 下方 Application Sheet 為申請書內容的填寫區域。"]
[null,"     2. 按下「清除申請人資料」按鈕可以清除前次的匯款申請人資料。"]
[null,"     3. 按下「清除匯款資料」按鈕可以清除前次的匯款金額資料。"]
[null,"     4. 資料內容只需要填寫",null,null,null,null,null," 顏色部份即可。"]
{"$rows_left_out":16}
{"sheet":"Application","index":1,"n_rows":72,"n_cols":14,"rows_kept":72,"cut":false,"hidden":false,"merged":[[64,1,64,2],[64,3,64,5],[65,1,65,2],[65,3,65,5],[65,6,66,6],[66,1,66,2],[66,3,66,5],[59,1,59,2],[59,3,59,5],[60,1,60,2],[60,3,60,5],[60,6,61,6],[61,1,61,2],[61,3,61,5],[63,1,63,2],[63,3,63,5],[53,3,53,5],[54,1,54,2],[54,3,54,5],[55,1,55,2],[55,3,55,5],[55,6,56,6],[56,1,56,2],[56,3,56,5],[58,1,58,2],[58,3,58,5],[70,1,72,2],[68,1,68,2],[68,3,68,5],[68,6,69,6],[69,1,69,2],[69,3,69,5],[20,6,21,6],[21,1,21,2],[43,1,43,2],[43,3,43,5],[48,1,48,2],[48,3,48,5],[21,3,21,5],[25,1,25,2],[25,3,25,5],[25,6,26,6],[49,1,49,2],[49,3,49,5],[50,1,50,2],[50,3,50,5],[50,6,51,6],[51,1,51,2],[51,3,51,5],[53,1,53,2],[18,1,18,2],[18,3,18,5],[19,1,19,2],[19,3,19,5],[23,1,23,2],[23,3,23,5],[24,1,24,2],[24,3,24,5],[20,1,20,2],[20,3,20,5],[26,1,26,2],[26,3,26,5],[28,1,28,2],[28,3,28,5],[29,1,29,2],[29,3,29,5],[2,1,2,6],[3,1,3,2],[3,4,3,6],[4,1,4,2],[4,3,4,6],[5,1,5,2],[5,3,5,6],[8,1,8,2],[8,3,8,6],[6,1,6,2],[6,3,6,6],[7,1,7,2],[7,3,7,6],[9,1,13,2],[10,4,12,4],[15,1,15,6],[16,1,16,2],[16,3,16,5],[35,6,36,6],[36,1,36,2],[36,3,36,5],[30,1,30,2],[30,3,30,5],[30,6,31,6],[31,1,31,2],[31,3,31,5],[33,1,33,2],[33,3,33,5],[38,1,38,2],[38,3,38,5],[39,1,39,2],[39,3,39,5],[40,1,40,2],[40,3,40,5],[34,1,34,2],[34,3,34,5],[35,1,35,2],[35,3,35,5],[40,6,41,6],[41,1,41,2],[41,3,41,5],[44,1,44,2],[44,3,44,5],[45,1,45,2],[45,3,45,5],[45,6,46,6],[46,1,46,2],[46,3,46,5]]}
[]
[]
[null,"匯款申請人資料"]
[null,"傳真指示扣帳",null,null,"← 請填入 ( 0:否 或是 1:是 )  [僅限與本行簽訂電話傳真交易授權書者適用]"]
[null,"匯款人姓名"]
[null,"統一編號/身分證字號"]
[null,"代理人",null,null,null,null,null,null,null,null,null,null,null,"【小提醒】"]
[null,"代理人身分證字號",null,null,null,null,null,null,null,null,null,null,null,"匯款金額超過 TWD30,000 時"]
[null,"連絡電話",null,null,null,null,null,null,null,null,null,null,null,"請記得填寫代理人相關資訊欄位"]
[null,"受理分行 (Branch)",null,"請填入代號"]
[null,null,null,null,null,null,"1. 臺北分行 Taipei Branch",null,null,1,"96978630","臺北",{"$f":"VLOOKUP(E11,$J$11:$L$13,3,FALSE)","v":{"$error":"#N/A"}}]
[null,null,null,null,null,null,"2. 臺中分行 Taichung Branch",null,null,2,"28425252","臺中",{"$f":"VLOOKUP(E11,$J$11:$L$13,2,FALSE)","v":{"$error":"#N/A"}}]
[null,null,null,null,null,null,"3. 高雄分行 Kaohsiung Branch",null,null,3,"86893726","高雄"]
[]
[]
{"$rows_left_out":58}
{"sheet":"Beneficiary","index":2,"n_rows":202,"n_cols":10,"rows_kept":202,"cut":false,"hidden":false,"merged":[]}
[null,null,"收款人資料檔"]
["代號","收款人帳號","收款人戶名","收款銀行名 (解款行庫)","收款銀行分支單位 (分行)","備註"]
["M001",null,null,null,null,null,null,null,null,{"$f":"LEN(B3)","v":0}]
["M002",null,null,null,null,null,null,null,null,{"$f":"LEN(B4)","v":0}]
["M003",null,null,null,null,null,null,null,null,0]
["M004",null,null,null,null,null,null,null,null,0]
["M005",null,null,null,null,null,null,null,null,0]
["M006",null,null,null,null,null,null,null,null,0]
["M007",null,null,null,null,null,null,null,null,0]
["M008",null,null,null,null,null,null,null,null,0]
["M009",null,null,null,null,null,null,null,null,0]
["M010",null,null,null,null,null,null,null,null,0]
["M011",null,null,null,null,null,null,null,null,0]
["M012",null,null,null,null,null,null,null,null,0]
["M013",null,null,null,null,null,null,null,null,0]
{"$rows_left_out":188}
{"sheet":"Account","index":3,"n_rows":22,"n_cols":3,"rows_kept":22,"cut":false,"hidden":false,"merged":[]}
[null,null,"帳號資料檔"]
["代號","帳號","備註"]
["A01"]
["A02"]
["A03"]
["A04"]
["A05"]
["A06"]
["A07"]
["A08"]
["A09"]
["M00"]
["A11"]
["A12"]
["A13"]
{"$rows_left_out":8}
{"sheet":"Form","index":4,"n_rows":123,"n_cols":44,"rows_kept":123,"cut":false,"hidden":false,"merged":[[6,0,14,0],[6,1,14,1],[7,31,12,31],[48,31,53,31],[6,3,6,5],[7,3,7,5],[7,7,7,20],[12,3,12,5],[6,30,7,30],[45,30,46,30],[8,30,9,30],[10,30,11,30],[12,30,13,30],[14,30,15,30],[16,30,17,30],[18,30,19,30],[20,30,21,30],[22,30,23,30],[24,30,25,30],[47,30,48,30],[49,30,50,30],[51,30,52,30],[28,26,28,30],[29,25,29,30],[89,31,94,31],[29,23,29,24],[28,23,28,25],[27,23,27,24],[80,1,80,8],[119,5,119,6],[119,7,119,16],[49,7,49,20],[106,7,106,20],[27,25,27,30],[33,3,33,6],[33,7,34,23],[86,30,87,30],[31,24,32,30],[43,5,43,28],[96,30,97,30],[53,30,54,30],[55,30,56,30],[57,30,58,30],[59,30,60,30],[61,30,62,30],[63,30,64,30],[98,30,99,30],[100,30,101,30],[121,9,121,12],[111,23,111,24],[50,7,50,20],[51,3,51,5],[52,3,52,5],[52,7,52,20],[53,7,53,20],[54,3,54,5],[54,7,54,20],[55,3,55,5],[56,3,56,5],[57,3,57,5],[58,3,58,5],[62,3,62,5],[63,3,63,5],[64,3,64,5],[65,3,65,5],[65,7,65,20],[59,3,59,5],[60,3,60,5],[60,7,60,20],[61,3,61,5],[59,7,59,20],[61,7,61,20],[3,15,3,16],[4,3,5,6],[4,7,5,20],[4,21,5,29],[3,18,3,19],[3,21,3,22],[83,33,83,42],[84,5,84,28],[85,15,85,16],[85,18,85,19],[85,21,85,22],[32,3,32,5],[42,33,42,42],[39,1,39,8],[45,3,46,6],[45,21,46,29],[4,30,5,30],[65,30,66,30],[13,3,13,5],[13,7,13,20],[8,3,8,5],[9,3,9,5],[9,7,9,20],[10,3,10,5],[11,3,11,5],[11,7,11,20],[8,7,8,20],[10,7,10,20],[18,3,18,5],[19,3,19,5],[19,7,19,20],[20,3,20,5],[18,7,18,20],[20,7,20,20],[14,3,14,5],[15,3,15,5],[15,7,15,20],[16,3,16,5],[17,3,17,5],[17,7,17,20],[14,7,14,20],[16,7,16,20],[25,3,25,5],[25,7,25,20],[26,3,29,3],[26,4,26,6],[26,7,26,18],[26,19,26,20],[27,4,29,6],[27,7,29,22],[21,3,21,5],[21,7,21,20],[22,3,22,5],[23,3,23,5],[23,7,23,20],[24,3,24,5],[22,7,22,20],[24,7,24,20],[32,6,32,23],[110,23,110,25],[70,23,70,24],[83,6,83,19],[83,21,83,23],[83,24,83,26],[45,7,46,20],[68,25,68,30],[69,26,69,30],[70,25,70,30],[102,30,103,30],[104,30,105,30],[106,30,107,30],[88,30,89,30],[90,30,91,30],[92,30,93,30],[94,30,95,30],[56,7,56,20],[55,7,55,20],[57,7,57,20],[58,7,58,20],[62,7,62,20],[64,7,64,20],[63,7,63,20],[47,0,54,0],[47,1,54,1],[47,3,47,5],[48,3,48,5],[48,7,48,20],[49,3,49,5],[47,7,47,20],[50,3,50,5],[53,3,53,5],[51,7,51,20],[74,23,74,27],[66,3,66,5],[66,7,66,20],[67,3,70,3],[67,4,67,6],[67,7,67,18],[67,19,67,20],[68,4,70,6],[68,7,70,22],[88,0,95,0],[88,1,95,1],[88,3,88,5],[89,3,89,5],[89,7,89,20],[90,3,90,5],[91,3,91,5],[91,7,91,20],[92,3,92,5],[93,3,93,5],[2,5,2,28],[1,24,1,26],[1,21,1,23],[1,6,1,19],[42,6,42,19],[42,21,42,23],[42,24,42,26],[44,15,44,16],[109,7,111,22],[44,18,44,19],[44,21,44,22],[109,23,109,24],[76,27,78,27],[109,25,109,30],[108,7,108,18],[108,19,108,20],[109,4,111,6],[102,3,102,5],[103,3,103,5],[103,7,103,20],[104,3,104,5],[105,3,105,5],[105,7,105,20],[102,7,102,20],[31,3,31,23],[6,7,6,20],[12,7,12,20],[35,4,36,23],[37,11,38,12],[37,17,38,18],[37,19,38,20],[106,3,106,5],[107,3,107,5],[107,7,107,20],[104,7,104,20],[98,3,98,5],[99,3,99,5],[99,7,99,20],[100,3,100,5],[101,3,101,5],[101,7,101,20],[98,7,98,20],[100,7,100,20],[93,7,93,20],[94,3,94,5],[95,3,95,5],[95,7,95,20],[96,3,96,5],[39,9,39,12],[121,1,121,8],[76,14,78,14],[76,18,78,18],[76,23,78,23],[115,5,115,6],[116,5,116,6],[117,5,117,6],[118,5,118,6],[115,7,116,30],[119,17,119,20],[117,7,117,30],[118,7,118,30],[97,3,97,5],[97,7,97,20],[96,7,96,20],[75,3,78,3],[86,3,87,6],[86,7,87,20],[86,21,87,29],[68,23,68,24],[69,23,69,25],[80,9,80,12],[74,14,74,18],[108,3,111,3],[108,4,108,6],[110,26,110,30],[111,25,111,30],[113,3,113,4],[113,5,113,6],[114,5,114,6],[88,7,88,20],[90,7,90,20],[92,7,92,20],[94,7,94,20],[113,7,114,30]]}
[null,null,null,{"$f":"IF(Application!D4=1,\"☑\",\"☐\")","v":"☐"},"傳真指示扣帳 (請勾選。僅限與本行簽訂電話傳真交易授權書者適用)"]
[null,null,null,null,null,null,"日 商 瑞 穗 銀 行",null,null,null,null,null,null,null,null,null,null,null,null,null,null,{"$f":"IF(ISERROR(Application!M11),\"臺北\",Application!M11)","v":"臺北"},null,null,"分行"]
[null,null,null,null,null,"Mizuho Bank, Ltd.  匯款申請書 (多筆)"]
[null,null,null,null,null,null,null,null,null,null,null,null,null,null,"中華民國",{"$f":"IF(Application!D17=\"\",\"\",YEAR(Application!D17)-1911)","v":""},null,"年",{"$f":"IF(Application!D17=\"\",\"\",MONTH(Application!D17))","v":""},null,"月",{"$f":"IF(Application!D17=\"\",\"\",DAY(Application!D17))","v":""},null,"日"]
[null,null,null,"解 款 行",null,null,null,"收 款 人 帳 號 ／ 戶 名",null,null,null,null,null,null,null,null,null,null,null,null,null,"匯  款  金  額",null,null,null,null,null,null,null,null,"手 續 費"]
[]
["◎請申請人詳閱客戶留底說明","◎粗線內各項申請人自行填妥",1,{"$f":"camera!$B$8","v":""},null,null,"銀行",{"$f":"camera!$B$4","v":""},null,null,null,null,null,null,null,null,null,null,null,null,null,"億","仟","佰","拾","萬","仟","佰","拾","元",{"$f":"IF(Application!D21<>\"\",Application!D21,0)","v":0}]
[null,null,null,{"$f":"camera!$C$8","v":""},null,null,"分行",{"$f":"camera!$B$6","v":""},null,null,null,null,null,null,null,null,null,null,null,null,null,{"$f":"AJ8","v":""},"","","","","","","",{"$f":"AR8","v":""},null,"①預金存查聯",null,{"$f":"Application!D20","v":0},null,{"$f":"IF($AH8=0,\"\",IF($AH8>=100000000,MID(RIGHTB($AH8,9),1,1),0))","v":""},{"$f":"IF($AH8=0,\"\",IF($AH8>=10000000,MID(RIGHTB($AH8,8),1,1),0))","v":""},{"$f":"IF($AH8=0,\"\",IF($AH8>=1000000,MID(RIGHTB($AH8,7),1,1),0))","v":""},{"$f":"IF($AH8=0,\"\",IF($AH8>=100000,MID(RIGHTB($AH8,6),1,1),0))","v":""},{"$f":"IF($AH8=0,\"\",IF($AH8>=10000,MID(RIGHTB($AH8,5),1,1),0))","v":""},{"$f":"IF($AH8=0,\"\",IF($AH8>=1000,MID(RIGHTB($AH8,4),1,1),0))","v":""},{"$f":"IF($AH8=0,\"\",IF($AH8>=100,MID(RIGHTB($AH8,3),1,1),0))","v":""},{"$f":"IF($AH8=0,\"\",IF($AH8>=10,MID(RIGHTB($AH8,2),1,1),0))","v":""},{"$f":"IF($AH8=0,\"\",IF($AH8>=1,MID(RIGHTB($AH8,1),1,1),0))","v":""}]
[null,null,2,{"$f":"camera!$E$8","v":""},null,null,"銀行",{"$f":"camera!$E$4","v":""},null,null,null,null,null,null,null,null,null,null,null,null,null,"億","仟","佰","拾","萬","仟","佰","拾","元",{"$f":"IF(Application!D26<>\"\",Application!D26,0)","v":0}]
[null,null,null,{"$f":"camera!$F$8","v":""},null,null,"分行",{"$f":"camera!$E$6","v":""},null,null,null,null,null,null,null,null,null,null,null,null,null,{"$f":"AJ10","v":""},"","","","","","","","",null,null,null,{"$f":"Application!D25","v":0},null,{"$f":"IF($AH10=0,\"\",IF($AH10>=100000000,MID(RIGHTB($AH10,9),1,1),0))","v":""},{"$f":"IF($AH10=0,\"\",IF($AH10>=10000000,MID(RIGHTB($AH10,8),1,1),0))","v":""},{"$f":"IF($AH10=0,\"\",IF($AH10>=1000000,MID(RIGHTB($AH10,7),1,1),0))","v":""},{"$f":"IF($AH10=0,\"\",IF($AH10>=100000,MID(RIGHTB($AH10,6),1,1),0))","v":""},{"$f":"IF($AH10=0,\"\",IF($AH10>=10000,MID(RIGHTB($AH10,5),1,1),0))","v":""},{"$f":"IF($AH10=0,\"\",IF($AH10>=1000,MID(RIGHTB($AH10,4),1,1),0))","v":""},{"$f":"IF($AH10=0,\"\",IF($AH10>=100,MID(RIGHTB($AH10,3),1,1),0))","v":""},{"$f":"IF($AH10=0,\"\",IF($AH10>=10,MID(RIGHTB($AH10,2),1,1),0))","v":""},{"$f":"IF($AH10=0,\"\",IF($AH10>=1,MID(RIGHTB($AH10,1),1,1),0))","v":""}]
[null,null,3,{"$f":"camera!$H$8","v":""},null,null,"銀行",{"$f":"camera!$H$4","v":""},null,null,null,null,null,null,null,null,null,null,null,null,null,"億","仟","佰","拾","萬","仟","佰","拾","元",{"$f":"IF(Application!D31<>\"\",Application!D31,0)","v":0}]
[null,null,null,{"$f":"camera!$I$8","v":""},null,null,"分行",{"$f":"camera!$H$6","v":""},null,null,null,null,null,null,null,null,null,null,null,null,null,{"$f":"AJ12","v":""},"","","","","","","","",null,null,null,{"$f":"Application!D30","v":0},null,{"$f":"IF($AH12=0,\"\",IF($AH12>=100000000,MID(RIGHTB($AH12,9),1,1),0))","v":""},{"$f":"IF($AH12=0,\"\",IF($AH12>=10000000,MID(RIGHTB($AH12,8),1,1),0))","v":""},{"$f":"IF($AH12=0,\"\",IF($AH12>=1000000,MID(RIGHTB($AH12,7),1,1),0))","v":""},{"$f":"IF($AH12=0,\"\",IF($AH12>=100000,MID(RIGHTB($AH12,6),1,1),0))","v":""},{"$f":"IF($AH12=0,\"\",IF($AH12>=10000,MID(RIGHTB($AH12,5),1,1),0))","v":""},{"$f":"IF($AH12=0,\"\",IF($AH12>=1000,MID(RIGHTB($AH12,4),1,1),0))","v":""},{"$f":"IF($AH12=0,\"\",IF($AH12>=100,MID(RIGHTB($AH12,3),1,1),0))","v":""},{"$f":"IF($AH12=0,\"\",IF($AH12>=10,MID(RIGHTB($AH12,2),1,1),0))","v":""},{"$f":"IF($AH12=0,\"\",IF($AH12>=1,MID(RIGHTB($AH12,1),1,1),0))","v":""}]
[null,null,4,{"$f":"camera!$B$16","v":""},null,null,"銀行",{"$f":"camera!$B$12","v":""},null,null,null,null,null,null,null,null,null,null,null,null,null,"億","仟","佰","拾","萬","仟","佰","拾","元",{"$f":"IF(Application!D36<>\"\",Application!D36,0)","v":0}]
[null,null,null,{"$f":"camera!$C$16","v":""},null,null,"分行",{"$f":"camera!$B$14","v":""},null,null,null,null,null,null,null,null,null,null,null,null,null,{"$f":"AJ14","v":""},"","","","","","","","",null,null,null,{"$f":"Application!D35","v":0},null,{"$f":"IF($AH14=0,\"\",IF($AH14>=100000000,MID(RIGHTB($AH14,9),1,1),0))","v":""},{"$f":"IF($AH14=0,\"\",IF($AH14>=10000000,MID(RIGHTB($AH14,8),1,1),0))","v":""},{"$f":"IF($AH14=0,\"\",IF($AH14>=1000000,MID(RIGHTB($AH14,7),1,1),0))","v":""},{"$f":"IF($AH14=0,\"\",IF($AH14>=100000,MID(RIGHTB($AH14,6),1,1),0))","v":""},{"$f":"IF($AH14=0,\"\",IF($AH14>=10000,MID(RIGHTB($AH14,5),1,1),0))","v":""},{"$f":"IF($AH14=0,\"\",IF($AH14>=1000,MID(RIGHTB($AH14,4),1,1),0))","v":""},{"$f":"IF($AH14=0,\"\",IF($AH14>=100,MID(RIGHTB($AH14,3),1,1),0))","v":""},{"$f":"IF($AH14=0,\"\",IF($AH14>=10,MID(RIGHTB($AH14,2),1,1),0))","v":""},{"$f":"IF($AH14=0,\"\",IF($AH14>=1,MID(RIGHTB($AH14,1),1,1),0))","v":""}]
[null,null,5,{"$f":"camera!$E$16","v":""},null,null,"銀行",{"$f":"camera!$E$12","v":""},null,null,null,null,null,null,null,null,null,null,null,null,null,"億","仟","佰","拾","萬","仟","佰","拾","元",{"$f":"IF(Application!D41<>\"\",Application!D41,0)","v":0}]
{"$rows_left_out":109}
{"sheet":"camera","index":5,"n_rows":32,"n_cols":9,"rows_kept":32,"cut":false,"hidden":true,"merged":[[12,1,12,2],[1,1,1,2],[4,1,4,2],[4,7,4,8],[5,7,5,8],[5,1,5,2],[9,4,9,5],[12,4,12,5],[13,4,13,5],[12,7,12,8],[1,4,1,5],[4,4,4,5],[5,4,5,5],[1,7,1,8],[28,1,28,2],[29,1,29,2],[25,1,25,2],[13,7,13,8],[9,7,9,8],[17,1,17,2],[20,1,20,2],[21,1,21,2],[20,4,20,5],[21,4,21,5],[17,4,17,5],[17,7,17,8],[20,7,20,8],[21,7,21,8],[13,1,13,2],[9,1,9,2]]}
[]
[null,"收款人1",null,null,"收款人2",null,null,"收款人3"]
[null,"收款人帳號","備註",null,"收款人帳號","備註",null,"收款人帳號","備註"]
[null,{"$f":"IF(ISERROR(VLOOKUP(Application!$D$19,Beneficiary!$A$3:$F$202,2,FALSE)),\"\",IF(VLOOKUP(Application!$D$19,Beneficiary!$A$3:$F$202,2,FALSE)=0,\"\",VLOOKUP(Application!$D$19,Beneficiary!$A$3:$F$202,2,FALSE)))","v":""},{"$f":"IF(ISERROR(VLOOKUP(Application!$D$19,Beneficiary!$A$3:$F$202,6,FALSE)),\"\",IF(VLOOKUP(Application!$D$19,Beneficiary!$A$3:$F$202,6,FALSE)=0,\"\",VLOOKUP(Application!$D$19,Beneficiary!$A$3:$F$202,6,FALSE)))","v":""},null,{"$f":"IF(ISERROR(VLOOKUP(Application!$D$24,Beneficiary!$A$3:$F$202,2,FALSE)),\"\",IF(VLOOKUP(Application!$D$24,Beneficiary!$A$3:$F$202,2,FALSE)=0,\"\",VLOOKUP(Application!$D$24,Beneficiary!$A$3:$F$202,2,FALSE)))","v":""},{"$f":"IF(ISERROR(VLOOKUP(Application!$D$24,Beneficiary!$A$3:$F$202,6,FALSE)),\"\",IF(VLOOKUP(Application!$D$24,Beneficiary!$A$3:$F$202,6,FALSE)=0,\"\",VLOOKUP(Application!$D$24,Beneficiary!$A$3:$F$202,6,FALSE)))","v":""},null,{"$f":"IF(ISERROR(VLOOKUP(Application!$D$29,Beneficiary!$A$3:$F$202,2,FALSE)),\"\",IF(VLOOKUP(Application!$D$29,Beneficiary!$A$3:$F$202,2,FALSE)=0,\"\",VLOOKUP(Application!$D$29,Beneficiary!$A$3:$F$202,2,FALSE)))","v":""},{"$f":"IF(ISERROR(VLOOKUP(Application!$D$29,Beneficiary!$A$3:$F$202,6,FALSE)),\"\",IF(VLOOKUP(Application!$D$29,Beneficiary!$A$3:$F$202,6,FALSE)=0,\"\",VLOOKUP(Application!$D$29,Beneficiary!$A$3:$F$202,6,FALSE)))","v":""}]
[null,"收款人戶名",null,null,"收款人戶名",null,null,"收款人戶名"]
[null,{"$f":"IF(ISERROR(VLOOKUP(Application!$D$19,Beneficiary!$A$3:$F$202,3,FALSE)),\"\",IF(VLOOKUP(Application!$D$19,Beneficiary!$A$3:$F$202,3,FALSE)=0,\"\",VLOOKUP(Application!$D$19,Beneficiary!$A$3:$F$202,3,FALSE)))","v":""},null,null,{"$f":"IF(ISERROR(VLOOKUP(Application!$D$24,Beneficiary!$A$3:$F$202,3,FALSE)),\"\",IF(VLOOKUP(Application!$D$24,Beneficiary!$A$3:$F$202,3,FALSE)=0,\"\",VLOOKUP(Application!$D$24,Beneficiary!$A$3:$F$202,3,FALSE)))","v":""},null,null,{"$f":"IF(ISERROR(VLOOKUP(Application!$D$29,Beneficiary!$A$3:$F$202,3,FALSE)),\"\",IF(VLOOKUP(Application!$D$29,Beneficiary!$A$3:$F$202,3,FALSE)=0,\"\",VLOOKUP(Application!$D$29,Beneficiary!$A$3:$F$202,3,FALSE)))","v":""}]
[null,"收款銀行名 (解款行庫)","收款銀行分支單位",null,"收款銀行名 (解款行庫)","收款銀行分支單位",null,"收款銀行名 (解款行庫)","收款銀行分支單位"]
[null,{"$f":"IF(ISERROR(VLOOKUP(Application!$D$19,Beneficiary!$A$3:$F$202,4,FALSE)),\"\",IF(VLOOKUP(Application!$D$19,Beneficiary!$A$3:$F$202,4,FALSE)=0,\"\",VLOOKUP(Application!$D$19,Beneficiary!$A$3:$F$202,4,FALSE)))","v":""},{"$f":"IF(ISERROR(VLOOKUP(Application!$D$19,Beneficiary!$A$3:$F$202,5,FALSE)),\"\",IF(VLOOKUP(Application!$D$19,Beneficiary!$A$3:$F$202,5,FALSE)=0,\"\",VLOOKUP(Application!$D$19,Beneficiary!$A$3:$F$202,5,FALSE)))","v":""},null,{"$f":"IF(ISERROR(VLOOKUP(Application!$D$24,Beneficiary!$A$3:$F$202,4,FALSE)),\"\",IF(VLOOKUP(Application!$D$24,Beneficiary!$A$3:$F$202,4,FALSE)=0,\"\",VLOOKUP(Application!$D$24,Beneficiary!$A$3:$F$202,4,FALSE)))","v":""},{"$f":"IF(ISERROR(VLOOKUP(Application!$D$24,Beneficiary!$A$3:$F$202,5,FALSE)),\"\",IF(VLOOKUP(Application!$D$24,Beneficiary!$A$3:$F$202,5,FALSE)=0,\"\",VLOOKUP(Application!$D$24,Beneficiary!$A$3:$F$202,5,FALSE)))","v":""},null,{"$f":"IF(ISERROR(VLOOKUP(Application!$D$29,Beneficiary!$A$3:$F$202,4,FALSE)),\"\",IF(VLOOKUP(Application!$D$29,Beneficiary!$A$3:$F$202,4,FALSE)=0,\"\",VLOOKUP(Application!$D$29,Beneficiary!$A$3:$F$202,4,FALSE)))","v":""},{"$f":"IF(ISERROR(VLOOKUP(Application!$D$29,Beneficiary!$A$3:$F$202,5,FALSE)),\"\",IF(VLOOKUP(Application!$D$29,Beneficiary!$A$3:$F$202,5,FALSE)=0,\"\",VLOOKUP(Application!$D$29,Beneficiary!$A$3:$F$202,5,FALSE)))","v":""}]
[]
[null,"收款人4",null,null,"收款人5",null,null,"收款人6"]
[null,"收款人帳號","備註",null,"收款人帳號","備註",null,"收款人帳號","備註"]
[null,{"$f":"IF(ISERROR(VLOOKUP(Application!$D$34,Beneficiary!$A$3:$F$202,2,FALSE)),\"\",IF(VLOOKUP(Application!$D$34,Beneficiary!$A$3:$F$202,2,FALSE)=0,\"\",VLOOKUP(Application!$D$34,Beneficiary!$A$3:$F$202,2,FALSE)))","v":""},{"$f":"IF(ISERROR(VLOOKUP(Application!$D$34,Beneficiary!$A$3:$F$202,6,FALSE)),\"\",IF(VLOOKUP(Application!$D$34,Beneficiary!$A$3:$F$202,6,FALSE)=0,\"\",VLOOKUP(Application!$D$34,Beneficiary!$A$3:$F$202,6,FALSE)))","v":""},null,{"$f":"IF(ISERROR(VLOOKUP(Application!$D$39,Beneficiary!$A$3:$F$202,2,FALSE)),\"\",IF(VLOOKUP(Application!$D$39,Beneficiary!$A$3:$F$202,2,FALSE)=0,\"\",VLOOKUP(Application!$D$39,Beneficiary!$A$3:$F$202,2,FALSE)))","v":""},{"$f":"IF(ISERROR(VLOOKUP(Application!$D$39,Beneficiary!$A$3:$F$202,6,FALSE)),\"\",IF(VLOOKUP(Application!$D$39,Beneficiary!$A$3:$F$202,6,FALSE)=0,\"\",VLOOKUP(Application!$D$39,Beneficiary!$A$3:$F$202,6,FALSE)))","v":""},null,{"$f":"IF(ISERROR(VLOOKUP(Application!$D$44,Beneficiary!$A$3:$F$202,2,FALSE)),\"\",IF(VLOOKUP(Application!$D$44,Beneficiary!$A$3:$F$202,2,FALSE)=0,\"\",VLOOKUP(Application!$D$44,Beneficiary!$A$3:$F$202,2,FALSE)))","v":""},{"$f":"IF(ISERROR(VLOOKUP(Application!$D$44,Beneficiary!$A$3:$F$202,6,FALSE)),\"\",IF(VLOOKUP(Application!$D$44,Beneficiary!$A$3:$F$202,6,FALSE)=0,\"\",VLOOKUP(Application!$D$44,Beneficiary!$A$3:$F$202,6,FALSE)))","v":""}]
[null,"收款人戶名",null,null,"收款人戶名",null,null,"收款人戶名"]
[null,{"$f":"IF(ISERROR(VLOOKUP(Application!$D$34,Beneficiary!$A$3:$F$202,3,FALSE)),\"\",IF(VLOOKUP(Application!$D$34,Beneficiary!$A$3:$F$202,3,FALSE)=0,\"\",VLOOKUP(Application!$D$34,Beneficiary!$A$3:$F$202,3,FALSE)))","v":""},null,null,{"$f":"IF(ISERROR(VLOOKUP(Application!$D$39,Beneficiary!$A$3:$F$202,3,FALSE)),\"\",IF(VLOOKUP(Application!$D$39,Beneficiary!$A$3:$F$202,3,FALSE)=0,\"\",VLOOKUP(Application!$D$39,Beneficiary!$A$3:$F$202,3,FALSE)))","v":""},null,null,{"$f":"IF(ISERROR(VLOOKUP(Application!$D$44,Beneficiary!$A$3:$F$202,3,FALSE)),\"\",IF(VLOOKUP(Application!$D$44,Beneficiary!$A$3:$F$202,3,FALSE)=0,\"\",VLOOKUP(Application!$D$44,Beneficiary!$A$3:$F$202,3,FALSE)))","v":""}]
[null,"收款銀行名 (解款行庫)","收款銀行分支單位",null,"收款銀行名 (解款行庫)","收款銀行分支單位",null,"收款銀行名 (解款行庫)","收款銀行分支單位"]
{"$rows_left_out":17}